{"text_format":"1","workbook":"xlsx","n_sheets":10,"sheets":["اطلاعات پایه","محاسبات حقوق ","پایه سنوات","جدول مالیات حقوق","جدول موظفی","Sheet4","Sheet2","اطلاعات","محاسبات","تقویم"],"not_rendered":{"charts":0,"images":3,"macros":1,"external_links":0,"defined_names":21,"comments":0,"pivot_tables":0},"unopened":[],"bounds":{"document_bytes":16777216,"sheet_cells":100000,"rows_first":2000,"rows_last":500,"rows_between":2000,"halvings":0,"cell_chars":16384,"cell_head_chars":4096},"cells_cut":0,"cells_raw":0,"read":"whole","date_system":"1900"}

{"sheet":"اطلاعات پایه","index":0,"n_rows":26,"n_cols":6,"rows_kept":26,"cut":false,"hidden":true,"merged":[]}
[]
[null,null,"آیتم های حقوق سال 1405","ساعتی (ریال)","روزانه (ریال)","ماهانه (ریال)"]
[null,null,"حداقل دستمزد",null,5541850,{"$f":"E3*30","v":166255500}]
[null,null,"بن کارگری",null,null,22000000]
[null,null,"حق مسکن",null,null,30000000]
[null,null,"حق تاهل",null,null,5000000]
[null,null,"حق اولاد",null,null,{"$f":"حداقل_دستمزد*3","v":16625550}]
[null,null,"پایه سنوات (با یک سال سابقه)",null,116666,{"$f":"E8*30","v":3499980}]
[null,null,"افزایش ساسر سطوح",null,null,"519549+%45"]
[null,null,"حق اولاد یک فرزند",null,null,{"$f":"F3*10%*1","v":16625550}]
[null,null,"حق اولاد دو فرزند",null,null,{"$f":"F3*10%*2","v":33251100}]
[null,null,"حق اولاد سه فرزند",null,null,{"$f":"F3*10%*3","v":49876650}]
[null,null,"حق اولاد",null,null,{"$f":"حداقل_دستمزد*3","v":16625550}]
[null,null,"مزد ساعتی",{"$f":"E3/7.33","v":756050.47748976806}]
[null,null,"اضافه کاری هر ساعت",1058470]
[null,null,"شب کاری هر ساعت",254618]
[null,null,"جمعه کاری هر ساعت",2216740]
[null,null,"صبح و عصر 10%",{"$f":"F3*10%","v":16625550}]
[null,null,"صبح، عصر  و شب 15%",{"$f":"F3*15%","v":24938325}]
[null,null,"صبح، عصر  یا عصر، شب 22.5%",{"$f":"F3*22.5%","v":37407487.5}]
{"$rows_left_out":7}
{"sheet":"محاسبات حقوق ","index":1,"n_rows":39,"n_cols":12,"rows_kept":39,"cut":false,"hidden":false,"merged":[[6,1,6,13],[24,2,24,3],[24,8,24,9],[9,2,9,3],[18,4,19,4],[17,2,17,3],[23,2,23,3],[20,2,20,3],[10,2,10,3],[10,5,10,6],[10,8,10,9],[14,8,14,9],[14,5,14,6],[29,5,29,6],[29,8,29,9],[29,11,29,12],[31,11,31,12],[28,2,28,3],[29,2,29,3],[31,2,31,3],[31,5,31,6],[26,11,26,12],[28,5,28,6],[16,8,16,9],[12,11,13,12],[12,8,13,9],[12,5,13,6],[12,10,13,10],[12,7,13,7],[28,8,28,9],[28,11,28,12],[20,5,20,6],[17,5,17,6],[17,8,17,9],[20,8,20,9],[23,5,23,6],[23,8,23,9],[26,2,26,3],[37,5,37,6],[37,8,37,9],[9,11,9,12],[9,8,9,9],[9,5,9,6],[16,5,16,6],[16,11,16,12],[10,11,10,12],[14,11,14,12],[17,11,17,12],[20,11,20,12],[23,11,23,12],[26,5,26,6],[26,8,26,9],[35,2,35,3],[31,8,31,9],[32,8,32,9],[32,2,32,3],[34,2,34,3],[34,5,34,6],[38,5,38,6],[38,8,38,9],[38,11,38,12],[32,11,32,12],[34,11,34,12],[35,11,35,12],[35,5,35,6],[34,8,34,9],[35,8,35,9],[37,11,37,12],[32,5,32,6]]}
[]
[]
[null,"محاسبه حقوق و دستمزد سال 1405"]
[]
[null,"نکته : تنها فیلدهای با رنگ خاکستری باید از طریق کاربر تکمیل شوند."]
[]
[null,"فروردین"]
[]
[]
[null,null,"روزهای کاری",null,"=","روزهای تعطیلات رسمی",null,"-","روزهای جمعه",null,"-","روزهای ماه"]
[null,null,{"$f":"IF(L11=\"\",\"\",L11-I11-F11)","v":20},null,"=",{"$f":"VLOOKUP(B7,'جدول موظفی'!B3:G14,4,0)","v":7},null,"-",{"$f":"VLOOKUP(B7,'جدول موظفی'!B3:G14,3,0)","v":4},null,"-",{"$f":"VLOOKUP(B7,'جدول موظفی'!B3:G14,2,0)","v":31}]
[]
[null,null,null,null,null,"ساعت موظفی",null,"=","ساعت متوسط کاری",null,"×","روزهای کاری"]
[]
[null,null,null,null,null,{"$f":"IF(L15=\"\",\"\",ROUND(L15*I15,0))","v":147},null,"=",{"$f":"IF(L15=\"\",\"\",7.33)","v":7.33},null,"×",{"$f":"C11","v":20}]
[]
[null,null,"روزهای کارکرد",null,null,"ساعت اضافه کاری",null,"=","ساعت موظفی",null,"-","ساعت کارکرد"]
[null,null,{"$f":"IF(L18=\"\",\"\",IF(L18<I18,ROUND((L18/I18)*L11,0),L11))","v":31},null,null,{"$f":"IF(L18=\"\",\"\",IF((L18-I18)<0,0,L18-I18))","v":73},null,"=",{"$f":"F15","v":147},null,"-",220]
[]
[null,null,"سال استخدام",null,null,"وضعیت تاهل",null,null,"تعداد فرزند",null,null,"سابقه بیمه (ماه)"]
{"$rows_left_out":20}
{"sheet":"پایه سنوات","index":2,"n_rows":33,"n_cols":34,"rows_kept":33,"cut":false,"hidden":true,"merged":[]}
["جدول پایه سنوات تجمیعی 30 سال گذشته با اعمال پایه های سنواتی گروه 1 ( از سال 1376 لغایت 1405)",null,null,null,null,null,null,null,null,null,null,null,null,null,null,null,null,null,null,null,null,null,null,null,null,null,null,null,null,null,null,null,"سال ","مبلغ"]
[null,1376,1377,1378,1379,"1380",1381,1382,1383,1384,1385,1386,1387,1388,1389,1390,1391,1392,1393,1394,"1395","1396","1397","1398","1399",1400,1401,1402,1403,1404,1405,null,{"$f":"TRANSPOSE(B2:AE2)","v":1376},{"$f":"TRANSPOSE(B3:AE3)","v":1929877}]
[1405,1929877,1925114,1919514,1912667,"1912667",1912667,1912667,1912667,1912667,1912667,1891001,1870314,1850646,1821216,1793460,1761036,1725649,1673004,1583019,"1504089","1384264","1275730","1143905","980143",798186,600404,436949,302969,166667,0,null,1377,1925114]
[1404,1216007,1212722,1208860,1204138,"1204138",1204138,1204138,1204138,1204138,1204138,1189196,1174929,1161365,1141068,1121926,1099565,1075160,1038853,976794,"922360","839722","764871","673957","561018",435530,299129,186401,94000,0,null,null,1378,1919514]
[1403,850005,847516,844590,841013,"841013",841013,841013,841013,841013,841013,829693,818885,808609,793233,778731,761791,743302,715797,668783,"627545","564940","508235","439361","353801",258734,155400,70000,0,null,null,null,1379,1912667]
[1402,639348,637308,634910,631978,"631978",631978,631978,631978,631978,631978,622699,613840,605417,592814,580927,567042,551887,529342,490806,"457004","405688","359209","302755","232624",154700,70000,0,null,null,null,null,"1380","1912667"]
[1401,470535,468849,466867,464444,"464444",464444,464444,464444,464444,464444,456776,449454,442493,432077,422253,410778,398253,379621,347773,"319838","277428","239015","192359","134400",70000,0,null,null,null,null,null,1381,1912667]
[1400,290243,289021,287585,285829,"285829",285829,285829,285829,285829,285829,280273,274967,269923,262375,255256,246941,237865,224363,201285,"181042","150310","122475","88666","46667",0,null,null,null,null,null,null,1382,1912667]
[1399,193315,192345,191205,189812,"189812",189812,189812,189812,189812,189812,185402,181191,177188,171197,165547,158948,151745,141029,122713,"106647","82257","60166","33333","0",null,null,null,null,null,null,null,1383,1912667]
[1398,139115,138271,137280,136069,"136069",136069,136069,136069,136069,136069,132234,128572,125091,119882,114969,109230,102967,93649,77722,"63751","42543","23333","0","",null,null,null,null,null,null,null,1384,1912667]
[1397,102462,101715,100838,99766,"99766",99766,99766,99766,99766,99766,96373,93132,90051,85442,81094,76015,70473,62227,48132,"35768","17000","0","","",null,null,null,null,null,null,null,1385,1912667]
[1396,77412,76735,75941,74970,"74970",74970,74970,74970,74970,74970,71896,68961,66170,61995,58057,53456,48436,40967,28200,"17000","0","","","",null,null,null,null,null,null,null,1386,1891001]
[1395,53940,53335,52626,51759,"51759",51759,51759,51759,51759,51759,49015,46394,43902,40174,36658,32550,28068,21399,10000,"0","","","","",null,null,null,null,null,null,null,1387,1870314]
[1394,38544,38014,37392,36631,"36631",36631,36631,36631,36631,36631,34224,31925,29739,26469,23385,19781,15850,10000,0,"","","","","",null,null,null,null,null,null,null,1388,1850646]
[1393,24397,23944,23412,22762,"22762",22762,22762,22762,22762,22762,20704,18739,16871,14076,11440,8360,5000,0,null,"","","","","",null,null,null,null,null,null,null,1389,1821216]
[1392,17319,16914,16439,15859,"15859",15859,15859,15859,15859,15859,14021,12267,10599,8104,5750,3000,0,null,null,"","","","","",null,null,null,null,null,null,null,1390,1793460]
[1391,13017,12649,12217,11690,"11690",11690,11690,11690,11690,11690,10019,8425,6908,4640,2500,0,null,null,null,"","","","","",null,null,null,null,null,null,null,1391,1761036]
[1390,9829,9485,9081,8589,"8589",8589,8589,8589,8589,8589,7027,5537,4120,2000,0,null,null,null,null,"","","","","",null,null,null,null,null,null,null,1392,1725649]
[1389,7386,7061,6680,6216,"6216",6216,6216,6216,6216,6216,4742,3337,2000,0,null,null,null,null,null,"","","","","",null,null,null,null,null,null,null,1393,1673004]
[1388,5034,4730,4374,3940,"3940",3940,3940,3940,3940,3940,2562,1250,0,null,null,null,null,null,null,"","","","","",null,null,null,null,null,null,null,1394,1583019]
{"$rows_left_out":14}
{"sheet":"جدول مالیات حقوق","index":3,"n_rows":18,"n_cols":7,"rows_kept":18,"cut":false,"hidden":true,"merged":[[1,1,1,6],[10,1,10,6]]}
[]
[null,"پلکان مالیات حقوق (ماهیانه) 1405"]
[null,"ردیف","شروع بازه","پایان بازه","نرخ مالیات","مبلغ مالیات پله","مالیات تجمیعی"]
[null,1,0,400000000,0,{"$f":"(D4-C4)*E4","v":0},0]
[null,2,{"$f":"D4","v":400000000},800000000,0.1,{"$f":"(D5-C5)*E5","v":40000000},{"$f":"G4+F5","v":40000000}]
[null,3,{"$f":"D5","v":800000000},1000000000,0.15,{"$f":"(D6-C6)*E6","v":30000000},{"$f":"G5+F6","v":70000000}]
[null,4,{"$f":"D6","v":1000000000},12000000000,0.2,2200000000,2270000000]
[null,5,{"$f":"D7","v":12000000000},14000000000,0.25,500000000,2770000000]
[null,6,{"$f":"D8","v":14000000000},999999999999,0.3,295799999999.70001,298569999999.70001]
[]
[null,"پلکان مالیات حقوق (سالیانه) 1405"]
[null,"ردیف","شروع بازه","پایان بازه","نرخ مالیات","مبلغ مالیات پله","مالیات تجمیعی"]
[null,1,0,4800000000,0,{"$f":"(D13-C13)*E13","v":0},0]
[null,2,{"$f":"D13","v":4800000000},9600000000,0.1,{"$f":"(D14-C14)*E14","v":480000000},{"$f":"G13+F14","v":480000000}]
[null,3,{"$f":"D14","v":9600000000},12000000000,0.15,{"$f":"(D15-C15)*E15","v":360000000},{"$f":"G14+F15","v":840000000}]
[null,4,{"$f":"D15","v":12000000000},14400000000,0.2,480000000,1320000000]
[null,5,{"$f":"D16","v":14400000000},16800000000,0.25,600000000,1920000000]
[null,6,{"$f":"D17","v":16800000000},999999999999,0.3,294959999999.70001,296879999999.70001]

{"sheet":"جدول موظفی","index":4,"n_rows":14,"n_cols":7,"rows_kept":14,"cut":false,"hidden":true,"merged":[]}
[]
[null,"ماه","تعداد روز ماه","تعداد روز جمعه","تعداد روز تعطیلات رسمی","روزهای کاری","ساعت موظفی سال 1405"]
[null,"فروردین",31,4,7,{"$f":"C3-D3-E3","v":20},{"$f":"F3*7.33","v":146.6}]
[null,"اردیبهشت",31,4,0,{"$f":"C4-D4-E4","v":27},{"$f":"F4*7.33","v":197.91}]
[null,"خرداد",31,5,2,{"$f":"C5-D5-E5","v":24},{"$f":"F5*7.33","v":175.92000000000002}]
[null,"تیر",31,4,2,25,183.25]
[null,"مرداد",31,5,3,23,168.59]
[null,"شهریور",31,4,1,26,190.58]
[null,"مهر",30,4,0,26,190.58]
[null,"آبان",30,5,0,25,183.25]
[null,"آذر",30,4,0,26,190.58]
[null,"دی",30,4,2,24,175.92000000000002]
[null,"بهمن",30,5,2,23,168.59]
[null,"اسفند",29,4,4,21,153.93]

{"sheet":"Sheet4","index":5,"n_rows":35,"n_cols":37,"rows_kept":35,"cut":false,"hidden":true,"merged":[]}
["سال","حداقل مزد روزانه","درصد افزایش مزد","مبلغ ثابت","افزایش پایه سنوات","مزد ثابت در سال 1372","مزد ثابت در سال 1373","مزد ثابت در سال 1374","مزد ثابت در سال 1375","مزد ثابت در سال 1376","مزد ثابت در سال 1377","مزد ثابت در سال 1378","مزد ثابت در سال 1379","مزد ثابت در سال 1380","مزد ثابت در سال 1381","مزد ثابت در سال 1382","مزد ثابت در سال 1383","مزد ثابت در سال 1384","مزد ثابت در سال 1385","مزد ثابت در سال 1386","مزد ثابت در سال 1387","مزد ثابت در سال 1388","مزد ثابت در سال 1389","مزد ثابت در سال 1390","مزد ثابت در سال 1391","مزد ثابت در سال 1392","مزد ثابت در سال 1393","مزد ثابت در سال 1394","مزد ثابت در سال 1395","مزد ثابت در سال 1396","مزد ثابت در سال 1397","مزد ثابت در سال 1398","مزد ثابت در سال 1399","مزد ثابت در سال 1400","مزد ثابت در سال 1401","مزد ثابت در سال 1402","مزد ثابت در سال 1405"]
[1372,2994,0.1,500,60,2994,{"$f":"G3+E3","v":3974},5521.4,7232.8979999999992,9006.9987439999986,10823.293511639999,13197.952213967998,16897.747435364799,21112.634807133039,26142.703373454027,32159.83854212673,40147.83854212673,46497.83854212673,57397.6223963394,64387.384635973343,78006.753867772015,94137.091561160618,109737.68797044187,121361.94924866837,144450.28569607518,181380.31426568271,229255.95197756463,278229.46381375066,327181.58874767576,390211.37939739687,476001.36285472615,648263.54002584051,835169.07102971664,1181765.029497443,1872557.7407064713,2419390.8662548303,4696756.371016779]
[1373,{"$f":"ROUNDUP(B2+(B2*C3)+D3,0)","v":3894},0.1,600,80,null,3894,5433.4,7138.7379999999994,8891.3702639999992,10686.273762839999,13033.528515407999,16716.881366948801,20922.725435296241,25944.248079884572,31951.4604838788,39939.4604838788,46289.4604838788,57168.406532266679,64135.247185493346,77742.009544768021,93859.110022006425,109440.24772354687,121046.66258695968,144112.92896804685,181009.22186485154,228840.32848863374,277743.18433170149,326627.23013813968,389590.49775471643,475315.90952120692,647488.97775896383,834278.32442280836,1180642.6887727384,1871008.9105063791,2417516.7817127188,4693738.3452701624]
[1374,{"$f":"(B3+(B3*C4)+D4)","v":5333.4},0.1,1050,100,null,null,5333,7031.31,8759.4486800000013,10529.946685800001,12845.936022960002,16510.529625256004,20706.056106518805,25717.82863131215,31713.720062877757,39701.720062877757,46051.720062877757,56906.892069165537,63847.581276082092,77439.960339886195,93541.95835688051,109100.89544186214,120686.94916837387,143728.03561016003,180585.83917117605,228366.13987171717,277188.38364990911,325994.75736089639,388882.12824420398,474533.86958160118,646605.27262720931,833262.06352129066,1179362.2000368263,1869241.8360508203,2415378.6216214923,4690295.0522592515]
[1375,{"$f":"(B4+(B4*C5)+D5)","v":6906.7379999999994},7.0000000000000007E-2,1200,125,null,null,null,6907,8606.7960000000003,10349.053260000001,12628.863912000001,16271.7503032,20455.33781836,25455.8280201862,31438.619421195508,39426.619421195508,45776.619421195508,56604.281363315058,63514.70949964656,77090.444974628888,93174.967223360334,108708.21492899556,120270.70782473529,143282.65737246675,180095.92310971342,227817.43388287904,276546.39764296846,325262.89331298403,388062.44051054213,473628.9343236385,645582.69578571152,832086.1001535682,1177880.4861934958,1867197.0709470243,2412904.4558458994,4686310.655694236]
[1376,8481.4742639999986,0.22800000000000001,0,125,null,null,null,null,8482,10201.17,12451.404,16076.544400000001,20250.371620000002,25241.638342900002,31213.720260045004,39201.720260045004,45551.720260045004,56356.892286049508,63242.581514654463,76804.710590387185,92874.946119906541,108387.1923483,119930.42388919799,142918.55356144183,179695.40891758603,227368.85798769636,276021.56384560477,324664.58278398943,387392.33271806815,472889.13532074721,644746.72291244438,831124.73134931107,1176669.1615001319,1865525.442870182,2410881.7858729204,4683053.3479697518]
[1377,10050.547002839998,0.185,0,150,null,null,null,null,null,10051,12271.2,15878.320000000002,20042.236000000001,25024.136620000001,30985.343451000001,38973.343451000001,45323.343451000001,56105.677796100004,62966.245575710003,76514.557854495506,92570.285747220274,108061.20574952569,119584.87809449722,142548.81956111203,179288.70151722323,226913.34569929002,275488.61446816934,324057.02049371303,386711.86295295862,472137.89670006628,643897.82327107491,830148.49676173611,1175439.1059197877,1863827.966169307,2408827.8390648616,4679745.6720300531]
[1378,12060.656403407997,0.2,0,210,null,null,null,null,null,null,12061,15647.1,19799.455000000002,24770.430475000001,30718.951998750003,38706.951998750003,45056.951998750003,55812.647198625004,62643.911918487502,76176.10751441188,92214.912890132473,107680.95679244175,119181.81419998825,142117.54119398742,178814.29531338616,226382.01075099249,274866.95257866121,323348.32593967376,385918.12505243463,471261.61005788785,642907.61936541332,829009.76227022533,1174004.3004604839,1861847.9346354678,2406432.0009089159,4675887.4142637178]
[1379,15266.722043748796,0.1,2000,380,null,null,null,null,null,null,null,15267,19400.349999999999,24353.365749999997,30281.034037499998,38269.034037499994,44619.034037499994,55330.937441249996,62250,75762.5,91780.625,107216.26875,118689.244875,141590.49201625001,178234.541217875,225732.68616402001,274107.24281190342,322482.25680556992,384948.1276222383,470190.73289495107,641697.52817129472,827618.15739698894,1172250.878320206,1859428.2120818843,2403504.1366190799,4671172.3816113658]
[1380,18930.058145936237,0.05,2900,470,null,null,null,null,null,null,null,null,18930,23861.85,29764.942499999997,37752.942499999997,44102.942499999997,54763.236749999996,62250,75762.5,91780.625,107216.26875,118689.244875,141590.49201625001,178234.541217875,225732.68616402001,274107.24281190342,322482.25680556992,384948.1276222383,470190.73289495107,641697.52817129472,827618.15739698894,1172250.878320206,1859428.2120818843,2403504.1366190799,4671172.3816113658]
[1381,23281.910762503368,4.4999999999999998E-2,3500,580,null,null,null,null,null,null,null,null,null,23282,29156.1,37144.1,43494.1,54093.509999999995,62250,75762.5,91780.625,107216.26875,118689.244875,141590.49201625001,178234.541217875,225732.68616402001,274107.24281190342,322482.25680556992,384948.1276222383,470190.73289495107,641697.52817129472,827618.15739698894,1172250.878320206,1859428.2120818843,2403504.1366190799,4671172.3816113658]
[1382,28446.006300628538,0.05,4000,710,null,null,null,null,null,null,null,null,null,null,28446,36434,42784,53312.4,62250,75762.5,91780.625,107216.26875,118689.244875,141590.49201625001,178234.541217875,225732.68616402001,274107.24281190342,322482.25680556992,384948.1276222383,470190.73289495107,641697.52817129472,827618.15739698894,1172250.878320206,1859428.2120818843,2403504.1366190799,4671172.3816113658]
[1383,35534.006300628535,0,7088,900,null,null,null,null,null,null,null,null,null,null,null,35534,41884,52322.400000000001,62250,75762.5,91780.625,107216.26875,118689.244875,141590.49201625001,178234.541217875,225732.68616402001,274107.24281190342,322482.25680556992,384948.1276222383,470190.73289495107,641697.52817129472,827618.15739698894,1172250.878320206,1859428.2120818843,2403504.1366190799,4671172.3816113658]
[1384,40864.006300628535,0,5330,1020,null,null,null,null,null,null,null,null,null,null,null,null,40864,51250,62250,75762.5,91780.625,107216.26875,118689.244875,141590.49201625001,178234.541217875,225732.68616402001,274107.24281190342,322482.25680556992,384948.1276222383,470190.73289495107,641697.52817129472,827618.15739698894,1172250.878320206,1859428.2120818843,2403504.1366190799,4671172.3816113658]
[1385,50000,0.1,5000,1250,null,null,null,null,null,null,null,null,null,null,null,null,null,50000,62250,75762.5,91780.625,107216.26875,118689.244875,141590.49201625001,178234.541217875,225732.68616402001,274107.24281190342,322482.25680556992,384948.1276222383,470190.73289495107,641697.52817129472,827618.15739698894,1172250.878320206,1859428.2120818843,2403504.1366190799,4671172.3816113658]
[1386,61000,0.1,0,1250,null,null,null,null,null,null,null,null,null,null,null,null,null,null,61000,74450,90402.5,105741.675,117126.1755,139918.00778499999,176394.8085635,223672.18559112001,271696.45714161044,319733.9611414359,381870.0364784082,466792.52027216263,637857.54790754372,823202.18009367527,1166686.7469180308,1851749.7107468825,2394213.150003728,4656210.1767660035]
[1387,73200,0.05,9150,1250,null,null,null,null,null,null,null,null,null,null,null,null,null,null,null,73200,89090,104337.3,115637.538,138325.16566,174642.682226,221709.80409312001,269400.47078895045,317116.53669940354,378938.52110333194,463556.12729807844,634200.42384682863,818996.4874238529,1161387.5741540547,1844436.8523325955,2385364.5913224407,4641960.4578656591]
[1388,87840,0.05,10980,1250,null,null,null,null,null,null,null,null,null,null,null,null,null,null,null,null,87840,102999.8,114219.788,136808.17316000001,172973.99047600001,219840.86933312,267213.81711975043,314623.75151651551,376146.60169849737,460473.84827514109,630717.44855090941,814991.06583354576,1156340.7429502676,1837472.2252713693,2376937.3925783569,4628389.2970081856]
[1389,100999.8,7.0000000000000007E-2,7011,2000,null,null,null,null,null,null,null,null,null,null,null,null,null,null,null,null,null,101000,112100,134540,170479,217046.48,263944.38160000002,310896.59502400004,371972.18642688007,455865.2938152756,625509.78201126144,809002.24931295065,1148794.8341343179,1827058.8711053587,2364337.234037484,4608098.001693964]
[1390,110099.788,0.06,3040,2000,null,null,null,null,null,null,null,null,null,null,null,null,null,null,null,null,null,null,110100,132400,168125,214410,260859.7,307380.05800000002,368033.66496000002,451517.16611584002,620596.39771089924,803351.85736753407,1141675.340283093,1817233.9695906683,2352449.1032047085,4588953.3558008634]
{"$rows_left_out":16}
{"sheet":"Sheet2","index":6,"n_rows":5,"n_cols":3,"rows_kept":5,"cut":false,"hidden":true,"merged":[]}
[]
[]
[null,null,"وضعیت تاهل"]
[null,null,"مجرد"]
[null,null,"متاهل"]

{"sheet":"اطلاعات","index":7,"n_rows":33,"n_cols":10,"rows_kept":33,"cut":false,"hidden":true,"merged":[]}
["آیتم های حقوق سال 1405","روزانه (ریال)","ماهانه (ریال)",null,"سابقه (سال)","پایه سنوات تجمیعی سال 1405",null,null,"ماه","تعداد روز"]
["حداقل دستمزد",5541850,{"$f":"B2*30","v":166255500},null,0,0,null,null,"فروردین",31]
["بن کارگری",null,22000000,null,1,116666,null,null,"اردیبهشت",31]
["حق مسکن",null,30000000,null,2,94000,null,null,"خرداد",31]
["حق تاهل",null,5000000,null,3,186400,null,null,"تیر",31]
["حق اولاد",null,{"$f":"حداقل_دستمزد*3","v":16625550},null,4,299128,null,null,"مرداد",31]
["پایه سنوات (با یک سال سابقه)",116666,{"$f":"B7*30","v":3499980},null,5,435529,null,null,"شهریور",31]
[null,null,null,null,6,561017,null,null,"مهر",30]
["نیروی مجرد (بدون سابقه)",null,{"$f":"SUM(C2:C4)","v":218255500},null,7,673958,null,null,"آبان",30]
["نیروی مجرد (با یک سال سابقه)",null,{"$f":"SUM(C2:C4,C7)","v":221755480},null,8,764873,null,null,"آذر",30]
["نیروی متاهل (بدون فرزند، بدون سابقه)",null,{"$f":"SUM(C2:C5)","v":223255500},null,9,839722,null,null,"دی",30]
["نیروی متاهل (با یک فرزند، بدون سابقه)",null,{"$f":"SUM(C2:C6)","v":239881050},null,10,922359,null,null,"بهمن",30]
["نیروی متاهل (بدون فرزند، با یک سال سابقه)",null,{"$f":"SUM(C2:C7,-C6)","v":226755480},null,11,976799,null,null,"اسفند",29]
["نیروی متاهل (با یک فرزند، با یک سال سابقه)",null,{"$f":"SUM(C2:C7)","v":243381030},null,12,1038860]
[null,null,null,null,13,1075168]
[null,null,null,null,14,1099568]
[null,null,null,null,15,1121934]
[null,null,null,null,16,1141081]
[null,null,null,null,17,1161373]
[null,null,null,null,18,1174944]
{"$rows_left_out":14}
{"sheet":"محاسبات","index":8,"n_rows":20,"n_cols":4,"rows_kept":20,"cut":false,"hidden":true,"merged":[[0,0,0,1],[1,0,1,1]]}
[null,null,null,30]
[]
[null,null,null,30]
["تاریخ استخدام","1390/07/25","<<=   تاریخ استخدام را کامل بنویسید، مثال =>> 1402/06/08"]
["انتخاب ماه","آبان","<<=   از لیست کشویی ماه را انتخاب کنید"]
["تاریخ محاسبه حقوق","1404/08/30","<<=   این آیتم به صورت خودکار محاسبه می شود"]
["روزهای کارکرد",30,{"$f":"\"<<=   در صورتیکه کارکرد کمتر از  \"&D1&\" روز است به صورت دستی بنویسید \"","v":"<<=   در صورتیکه کارکرد کمتر از  30 روز است به صورت دستی بنویسید "}]
["وضعیت تاهل","متاهل","<<=   از لیست کشویی وضعیت تاهل را انتخاب کنید"]
["تعداد فرزند",2,"<<=   تعداد فرزندان را وارد کنید (عامل محاسبه حق اولاد)"]
["سابقه به سال",{"$f":"IFERROR(INT((MATCH(B6,تقویم!B:B,0)-MATCH(B4,تقویم!B:B,0))/365.25),0)","v":14},"<<=   سابقه در کارگاه کنونی، به صورت خودکار محاسبه می شود (عامل محاسبه پایه سنوات)"]
["سابقه بیمه به روز",720,"<<=   سابقه بیمه را به روز وارد کنید (عامل محاسبه حق اولاد)"]
[]
["پایه حقوق",103909680,"<<=   این آیتم تحت تاثیر روزهای کارکرد است"]
["بن کارگری",22000000,"<<=   این آیتم تحت تاثیر روزهای کارکرد است"]
["حق مسکن",9000000,"<<=   این آیتم تحت تاثیر روزهای کارکرد است"]
["حق عائله مندی",5000000,"<<=   این آیتم تحت تاثیر وضعیت تاهل و روزهای کارکرد است"]
["حق اولاد",20781936,"<<=   این آیتم تحت تاثیر وضعیت تاهل، سابقه بیمه، تعداد فرزند و روزهای کارکرد است"]
["پایه سنوات",33658020,"<<=   این آیتم تحت تاثیر سابقه شخص در کارگاه کنونی است"]
[]
["جمع ناخالص حقوق و مزایا",{"$f":"SUM(B13:B18)","v":194349636},"<<=  مبلغ محاسبه شده به معنای مبلغ قابل پرداخت نیست و باید کسورات قانونی نیز از آن کسر شود"]
{"$rows_left_out":1}
{"sheet":"تقویم","index":9,"n_rows":16437,"n_cols":2,"rows_kept":16437,"cut":false,"hidden":true,"merged":[]}
["میلادی","شمسی"]
["1991-03-21","1370/01/01"]
["1991-03-22","1370/01/02"]
["1991-03-23","1370/01/03"]
["1991-03-24","1370/01/04"]
["1991-03-25","1370/01/05"]
["1991-03-26","1370/01/06"]
["1991-03-27","1370/01/07"]
["1991-03-28","1370/01/08"]
["1991-03-29","1370/01/09"]
["1991-03-30","1370/01/10"]
["1991-03-31","1370/01/11"]
["1991-04-01","1370/01/12"]
["1991-04-02","1370/01/13"]
["1991-04-03","1370/01/14"]
["1991-04-04","1370/01/15"]
["1991-04-05","1370/01/16"]
["1991-04-06","1370/01/17"]
["1991-04-07","1370/01/18"]
["1991-04-08","1370/01/19"]
{"$rows_left_out":16417}